Installation problem on MAC

Install support for openEMS

Moderators: thorsten, sebastian

Post Reply
Kevin
Posts: 1
Joined: Thu 05 Nov 2020, 10:23

Installation problem on MAC

Post by Kevin » Thu 05 Nov 2020, 10:30

Hi,
I'm using the brew file to install and I'm getting an error. Here's the relevant section from the log file. I'm not sure how to fix this..

/usr/local/include/vtk-9.0/vtkCellArray.h:1434:26: note: candidate function not viable: requires single argument 'pts', but 2 arguments were provided
inline int vtkCellArray::GetNextCell(vtkIdList* pts)
^
[ 74%] Building CXX object src/CMakeFiles/CSXCAD.dir/CSPropDebyeMaterial.cpp.o
1 error generated.
make[5]: *** [src/CMakeFiles/CSXCAD.dir/CSPrimPolyhedronReader.cpp.o] Error 1
make[5]: *** Waiting for unfinished jobs....
make[4]: *** [src/CMakeFiles/CSXCAD.dir/all] Error 2
make[3]: *** [all] Error 2
make[2]: *** [CSXCAD-prefix/src/CSXCAD-stamp/CSXCAD-build] Error 2
make[1]: *** [CMakeFiles/CSXCAD.dir/all] Error 2
make: *** [all] Error 2


Post Reply